{"text_format":"1","workbook":"xlsx","n_sheets":6,"sheets":["A","B","C","D","E","Maestros"],"not_rendered":{"charts":0,"images":6,"macros":1,"external_links":0,"defined_names":3,"comments":0,"pivot_tables":0},"unopened":[],"bounds":{"document_bytes":16777216,"sheet_cells":100000,"rows_first":2000,"rows_last":500,"rows_between":2000,"halvings":0,"cell_chars":16384,"cell_head_chars":4096},"cells_cut":0,"cells_raw":0,"read":"whole","date_system":"1900"}

{"sheet":"A","index":0,"n_rows":53,"n_cols":22,"rows_kept":53,"cut":false,"hidden":false,"merged":[[8,16,8,17],[8,19,9,19],[8,20,9,20],[8,21,9,21],[8,2,10,2],[8,3,10,3],[8,5,10,5],[8,6,10,6],[8,4,10,4],[8,1,10,1],[9,10,10,10],[9,11,10,11],[8,13,9,13],[8,14,8,15]]}
[null,null,"CUADRO A: IDENTIFICACIÓN DE NECESIDADES DE HORAS PEDAGÓGICAS LECTIVAS"]
[null,null,"REGIÓN:",null,null,null,null,null,null,null,null,"JUNIN"]
[null,null,"NOMBRE COMPLETO DEL IEST:",null,null,null,null,null,null,null,null,"IESTP \"MARCO\""]
[null,null,"CODIGO MODULAR:",null,null,null,null,null,null,null,null,814749]
[null,null,"PROGRAMA DE ESTUDIOS:",null,null,null,null,null,null,null,null,"ENFERMERIA TECNICA"]
[null,null,"SEDE O FILIAL:"]
[]
[null,null,null,null,"Plan de estudios",null,null,null,null,null,null,null,null,"Estudiantes y ambiente de aprendizaje ",null,null,null,null,null,"Carga lectiva requerida"]
[null,"Periodo académico","Módulo formativo asociado","Unidad Didáctica (UD)","Nombre de Unidad Didáctica (UD)","Créditos","Tipo de competencia Específicas, Empleabilidad o Transversal ",null,"Horas Semanales por UD",null,"Perfil Docente",null,null,"Número proyectado de estudiantes matriculados","Capacidad",null,"Proyección de número de espacios formativos",null,null,"Número de horas teórico-prácticas","Número de horas prácticas","Total de horas lectivas requeridas"]
[null,null,null,null,null,null,null,"Horas teórico - prácticas (TP)","Horas prácticas (P)","Horas semanales por UD","Formación Académica","Experiencia específica",null,null,"Capacidad de ambientes de aprendizaje para hora TP ","Capacidad de ambientes de aprendizaje para hora P ","Número de secciones teórico-prácticas","Número de grupos de práctica"]
[null,null,null,null,null,null,null,"(1)","(2)","(3)= (1)+(2)",null,null,null,"(4)","(5)","(6)","(7)=(4)/(5)","(8)=(4)/(6)",null,"(9)=(1)*(7)","(10)=(2)*(8)","(11)=(9)+(10)"]
[null,"Mar-Jul","Módulo 1",{"$f":"+\"UD \"&1","v":"UD 1"},"Salud comunitaria y familiar",5,"Especificas",6,{"$f":"SUM(G12:H12)","v":6},{"$f":"SUM(H12:I12)","v":12},"Lic en enfermeria","Formacion en SC",null,36,36,9,{"$f":"IF(O12>0,ROUNDUP(N12/O12,0),0)","v":1},{"$f":"IF(P12>0,ROUNDUP(N12/P12,0),0)","v":4},null,{"$f":"+H12*Q12","v":6},24,{"$f":"SUM(T12:U12)","v":30}]
[null,{"$f":"+B12","v":"Mar-Jul"},{"$f":"+C12","v":"Módulo 1"},{"$f":"+\"UD \"&(MID(D12,3,20)*1+1)","v":"UD 2"},"Tecnicas de comunicación en salud",3,"Especificas",4,{"$f":"SUM(G13:H13)","v":4},{"$f":"SUM(H13:I13)","v":8},"Lic en enfermeria","Formacion en TC",null,36,36,9,{"$f":"IF(O13>0,ROUNDUP(N13/O13,0),0)","v":1},{"$f":"IF(P13>0,ROUNDUP(N13/P13,0),0)","v":4},null,4,16,{"$f":"SUM(T13:U13)","v":20}]
[null,{"$f":"+B13","v":"Mar-Jul"},{"$f":"+C13","v":"Módulo 1"},"UD 3","Anatomia funcional",4,"Especificas",4,4,8,"Lic en enfermeria","Formacion en AF",null,36,36,9,1,4,null,4,16,20]
[null,{"$f":"+B14","v":"Mar-Jul"},"Módulo 1","UD 4","Primeros auxilios",4,"Especificas",4,{"$f":"SUM(G15:H15)","v":4},{"$f":"SUM(H15:I15)","v":8},"Lic en enfermeria","Formacion en PA",null,36,36,0,{"$f":"IF(O15>0,ROUNDUP(N15/O15,0),0)","v":1},{"$f":"IF(P15>0,ROUNDUP(N15/P15,0),0)","v":0},null,{"$f":"+H15*Q15","v":4},{"$f":"+I15*R15","v":0},{"$f":"SUM(T15:U15)","v":4}]
{"$rows_left_out":39}
{"sheet":"B","index":1,"n_rows":53,"n_cols":24,"rows_kept":53,"cut":false,"hidden":false,"merged":[[48,19,48,20],[51,19,51,20],[52,19,52,20],[36,19,36,20],[37,19,37,20],[38,19,38,20],[39,19,39,20],[40,19,40,20],[41,19,41,20],[42,19,42,20],[43,19,43,20],[44,19,44,20],[30,19,30,20],[31,19,31,20],[32,19,32,20],[33,19,33,20],[34,19,34,20],[35,19,35,20],[45,19,45,20],[46,19,46,20],[47,19,47,20],[52,17,52,18],[7,19,7,20],[8,19,8,20],[9,19,9,20],[10,19,10,20],[11,19,11,20],[12,19,12,20],[13,19,13,20],[14,19,14,20],[15,19,15,20],[16,19,16,20],[17,19,17,20],[18,19,18,20],[19,19,19,20],[20,19,20,20],[21,19,21,20],[22,19,22,20],[23,19,23,20],[24,19,24,20],[25,19,25,20],[26,19,26,20],[27,19,27,20],[28,19,28,20],[29,19,29,20],[41,17,41,18],[42,17,42,18],[43,17,43,18],[44,17,44,18],[45,17,45,18],[46,17,46,18],[47,17,47,18],[48,17,48,18],[51,17,51,18],[32,17,32,18],[33,17,33,18],[34,17,34,18],[35,17,35,18],[36,17,36,18],[37,17,37,18],[38,17,38,18],[39,17,39,18],[40,17,40,18],[23,17,23,18],[24,17,24,18],[25,17,25,18],[26,17,26,18],[27,17,27,18],[28,17,28,18],[29,17,29,18],[30,17,30,18],[31,17,31,18],[14,17,14,18],[15,17,15,18],[16,17,16,18],[17,17,17,18],[18,17,18,18],[19,17,19,18],[20,17,20,18],[21,17,21,18],[22,17,22,18],[42,15,42,16],[43,15,43,16],[44,15,44,16],[45,15,45,16],[46,15,46,16],[47,15,47,16],[48,15,48,16],[51,15,51,16],[52,15,52,16],[33,15,33,16],[34,15,34,16],[35,15,35,16],[36,15,36,16],[37,15,37,16],[38,15,38,16],[39,15,39,16],[40,15,40,16],[41,15,41,16],[24,15,24,16],[25,15,25,16],[26,15,26,16],[27,15,27,16],[28,15,28,16],[29,15,29,16],[30,15,30,16],[31,15,31,16],[32,15,32,16],[44,13,44,14],[45,13,45,14],[46,13,46,14],[47,13,47,14],[48,13,48,14],[51,13,51,14],[52,13,52,14],[7,15,7,16],[8,15,8,16],[9,15,9,16],[10,15,10,16],[11,15,11,16],[12,15,12,16],[13,15,13,16],[14,15,14,16],[15,15,15,16],[16,15,16,16],[17,15,17,16],[18,15,18,16],[19,15,19,16],[20,15,20,16],[21,15,21,16],[22,15,22,16],[23,15,23,16],[35,13,35,14],[36,13,36,14],[37,13,37,14],[38,13,38,14],[39,13,39,14],[40,13,40,14],[41,13,41,14],[42,13,42,14],[43,13,43,14],[26,13,26,14],[27,13,27,14],[28,13,28,14],[29,13,29,14],[30,13,30,14],[31,13,31,14],[32,13,32,14],[33,13,33,14],[34,13,34,14],[51,9,51,10],[51,11,51,12],[52,7,52,8],[52,9,52,10],[52,11,52,12],[7,13,7,14],[8,13,8,14],[9,13,9,14],[10,13,10,14],[11,13,11,14],[12,13,12,14],[13,13,13,14],[14,13,14,14],[15,13,15,14],[16,13,16,14],[17,13,17,14],[18,13,18,14],[19,13,19,14],[20,13,20,14],[21,13,21,14],[22,13,22,14],[23,13,23,14],[24,13,24,14],[25,13,25,14],[51,1,52,3],[1,1,1,5],[8,7,8,8],[7,7,7,8],[9,7,9,8],[2,1,5,1],[51,7,51,8],[13,2,13,3],[13,7,13,8],[2,2,5,2],[2,3,5,3],[2,5,5,5],[2,4,5,4],[10,7,10,8],[11,7,11,8],[12,7,12,8],[20,2,20,3],[20,7,20,8],[21,7,21,8],[28,7,28,8],[35,7,35,8],[42,7,42,8],[48,2,48,3],[48,7,48,8],[9,9,9,10],[9,11,9,12],[13,9,13,10],[13,11,13,12],[11,9,11,10],[11,11,11,12],[12,9,12,10],[1,22,1,23],[7,11,7,12],[8,11,8,12],[7,9,7,10],[8,9,8,10],[2,22,5,22],[2,23,5,23],[10,9,10,10],[10,11,10,12],[7,17,7,18],[8,17,8,18],[9,17,9,18],[10,17,10,18],[11,17,11,18],[12,17,12,18],[13,17,13,18],[17,9,17,10],[17,11,17,12],[18,7,18,8],[18,9,18,10],[18,11,18,12],[19,7,19,8],[19,9,19,10],[19,11,19,12],[12,11,12,12],[14,7,14,8],[14,9,14,10],[14,11,14,12],[15,7,15,8],[15,9,15,10],[15,11,15,12],[21,9,21,10],[21,11,21,12],[22,7,22,8],[22,9,22,10],[22,11,22,12],[16,7,16,8],[16,9,16,10],[16,11,16,12],[27,2,27,3],[27,7,27,8],[27,9,27,10],[27,11,27,12],[24,7,24,8],[24,9,24,10],[24,11,24,12],[25,7,25,8],[25,9,25,10],[25,11,25,12],[26,7,26,8],[26,9,26,10],[26,11,26,12],[20,9,20,10],[20,11,20,12],[17,7,17,8],[28,9,28,10],[28,11,28,12],[29,7,29,8],[29,9,29,10],[29,11,29,12],[23,7,23,8],[23,9,23,10],[23,11,23,12],[34,2,34,3],[34,7,34,8],[34,9,34,10],[34,11,34,12],[31,7,31,8],[31,9,31,10],[31,11,31,12],[32,7,32,8],[32,9,32,10],[32,11,32,12],[33,7,33,8],[33,9,33,10],[33,11,33,12],[35,9,35,10],[35,11,35,12],[36,7,36,8],[36,9,36,10],[36,11,36,12],[30,7,30,8],[30,9,30,10],[30,11,30,12],[41,2,41,3],[41,7,41,8],[41,9,41,10],[41,11,41,12],[38,7,38,8],[38,9,38,10],[38,11,38,12],[39,7,39,8],[39,9,39,10],[39,11,39,12],[40,7,40,8],[40,9,40,10],[40,11,40,12],[42,9,42,10],[42,11,42,12],[43,7,43,8],[43,9,43,10],[43,11,43,12],[37,7,37,8],[37,9,37,10],[37,11,37,12],[44,7,44,8],[44,9,44,10],[44,11,44,12],[48,9,48,10],[48,11,48,12],[45,7,45,8],[45,9,45,10],[45,11,45,12],[46,7,46,8],[46,9,46,10],[46,11,46,12],[47,7,47,8],[47,9,47,10],[47,11,47,12]]}
[null,null,{"$f":"+C3","v":"Módulo formativo asociado"},"Unidad Didáctica","Nombre de Unidad Didáctica (UD)","Carga lectiva requerida",0,"Nombre:","CARMEN ROSA CRISOSTOMO ELESCANO","Nombre:","TEODOLINDA JUANA ORIHUELA BENITO","Nombre:","ANGELICA GRACIELA MANTARI BUENDIA",{"$f":"+N3","v":"Nombre:"},"NORMA YOLANDA CONDOR LAZO",{"$f":"+P3","v":"Nombre:"},"LUCY AMELIA CARDENAS ILLESCAS",{"$f":"+R3","v":"Nombre:"},"JESUS ROBERTO GUTIERREZ  CANGAHUALA ",{"$f":"+T3","v":"Nombre:"},"PERCY EDGAR ROJAS HUANQUI",0,"Horas distribuidas",{"$f":"+X3","v":"Necesidad de horas"}]
[null,"Plan de estudios",null,null,null,null,null,"Docentes de Carrera Pública",null,null,null,null,null,null,null,null,null,null,null,null,null,null,"Resultado "]
[null,"Periodo académico","Módulo formativo asociado","Unidad Didáctica","Nombre de Unidad Didáctica (UD)","Carga lectiva requerida",null,"Nombre:","CARMEN ROSA CRISOSTOMO ELESCANO","Nombre:","TEODOLINDA JUANA ORIHUELA BENITO","Nombre:","ANGELICA GRACIELA MANTARI BUENDIA","Nombre:","NORMA YOLANDA CONDOR LAZO","Nombre:","LUCY AMELIA CARDENAS ILLESCAS","Nombre:","JESUS ROBERTO GUTIERREZ  CANGAHUALA ","Nombre:","PERCY EDGAR ROJAS HUANQUI",null,"Horas distribuidas","Necesidad de horas"]
[null,null,null,null,null,null,null,"DNI N°",19926825,"DNI N°",20640096,"DNI N°",19959386,"DNI N°",20041828,"DNI N°",21252068,"DNI N°",20429212,"DNI N°",23271260]
[null,null,null,null,null,null,null,"Área de desempeño ","DOCENTE","Área de desempeño ","DOCENTE","Área de desempeño ","DOCENTE","Área de desempeño ","DOCENTE","Área de desempeño ","DOCENTE","Área de desempeño ","DOCENTE","Área de desempeño ","DOCENTE"]
[null,null,null,null,null,null,null,"Jornada laboral:",40,"Jornada laboral:",40,"Jornada laboral:",40,"Jornada laboral:",40,"Jornada laboral:",40,"Jornada laboral:",40,"Jornada laboral:",40]
[null,null,null,null,null,null,null,"xxxx","xxxx","xxxx","xxxx","xxxx","xxxx","xxxx","xxxx","xxxx","xxxx","xxxx","xxxx","xxxx","xxxx",null,"(Suma de carga lectiva distribuida por UD)","(Carga lectiva requerida -Horas Distribuidas)"]
[null,{"$f":"+A!B12","v":"Mar-Jul"},{"$f":"+A!C12","v":"Módulo 1"},{"$f":"+\"UD \"&1","v":"UD 1"},{"$f":"+A!E12","v":"Salud comunitaria y familiar"},{"$f":"+A!V12","v":30},{"$f":"+B8&\"_\"&C8&\"_\"&D8","v":"Mar-Jul_Módulo 1_UD 1"},null,null,null,null,null,null,null,null,8,null,null,null,null,null,null,{"$f":"SUM(H8:M8)","v":0},{"$f":"F8-W8","v":30}]
[null,{"$f":"+A!B13","v":"Mar-Jul"},{"$f":"+A!C13","v":"Módulo 1"},{"$f":"+\"UD \"&(MID(D8,3,20)*1+1)","v":"UD 2"},{"$f":"+A!E13","v":"Tecnicas de comunicación en salud"},{"$f":"+A!V13","v":20},{"$f":"+B9&\"_\"&C9&\"_\"&D9","v":"Mar-Jul_Módulo 1_UD 2"},null,null,5,null,null,null,null,null,null,null,null,null,null,null,"a",{"$f":"SUM(H9:M9)","v":5},{"$f":"F9-W9","v":15}]
[null,{"$f":"+A!B14","v":"Mar-Jul"},{"$f":"+A!C14","v":"Módulo 1"},{"$f":"+\"UD \"&(MID(D9,3,20)*1+1)","v":"UD 3"},{"$f":"+A!E14","v":"Anatomia funcional"},{"$f":"+A!V14","v":20},"Mar-Jul_Módulo 1_UD 3",null,null,null,null,6,null,null,null,null,null,null,null,null,null,"b",6,14]
[null,{"$f":"+A!B15","v":"Mar-Jul"},{"$f":"+A!C15","v":"Módulo 1"},{"$f":"+\"UD \"&(MID(D10,3,20)*1+1)","v":"UD 4"},{"$f":"+A!E15","v":"Primeros auxilios"},{"$f":"+A!V15","v":4},{"$f":"+B11&\"_\"&C11&\"_\"&D11","v":"Mar-Jul_Módulo 1_UD 4"}]
[null,{"$f":"+A!B16","v":"Mar-Jul"},{"$f":"+A!C16","v":"Módulo 1"},{"$f":"+\"UD \"&(MID(D11,3,20)*1+1)","v":"UD 5"},{"$f":"+A!E16","v":"Comunicación oral"},{"$f":"+A!V16","v":4},{"$f":"+B12&\"_\"&C12&\"_\"&D12","v":"Mar-Jul_Módulo 1_UD 5"}]
[null,{"$f":"+A!B17","v":"Mar-Jul"},{"$f":"+A!C17","v":"Módulo 1"},{"$f":"+\"UD \"&(MID(D12,3,20)*1+1)","v":"UD 6"},{"$f":"+A!E17","v":"Ofimatica"},{"$f":"+A!V17","v":4},{"$f":"+B13&\"_\"&C13&\"_\"&D13","v":"Mar-Jul_Módulo 1_UD 6"}]
[null,null,{"$f":"+A!D18","v":"Sub total Módulo 1"},null,null,{"$f":"SUM(F8:F10)","v":70},"_Sub total Módulo 1_",{"$f":"SUM(H8:I10)","v":0},null,{"$f":"SUM(J8:K10)","v":5},null,{"$f":"SUM(L8:M10)","v":6},null,{"$f":"SUM(N8:O10)","v":0},null,{"$f":"SUM(P8:Q10)","v":8},null,{"$f":"SUM(R8:S10)","v":0},null,{"$f":"SUM(T8:U10)","v":0},null,"c"]
[null,{"$f":"+A!B19","v":"Mar-Jul"},{"$f":"+A!C19","v":"Módulo 2"},{"$f":"+\"UD \"&1","v":"UD 1"},{"$f":"+A!E19","v":"Asistencia al usuario ambulatorio y hospitalizado"},{"$f":"+A!V19","v":48},{"$f":"+B15&\"_\"&C15&\"_\"&D15","v":"Mar-Jul_Módulo 2_UD 1"},null,null,8,null,null,null,8,null,null,null,null,null,null,null,null,{"$f":"SUM(H15:M15)","v":8},{"$f":"F15-W15","v":40}]
{"$rows_left_out":39}
{"sheet":"C","index":2,"n_rows":36,"n_cols":22,"rows_kept":36,"cut":false,"hidden":false,"merged":[[23,17,23,18],[24,17,24,18],[25,17,25,18],[26,17,26,18],[32,15,32,16],[8,17,8,18],[9,17,9,18],[10,17,10,18],[11,17,11,18],[12,17,12,18],[13,17,13,18],[14,17,14,18],[15,17,15,18],[16,17,16,18],[17,17,17,18],[20,17,20,18],[21,17,21,18],[23,15,23,16],[24,15,24,16],[25,15,25,16],[26,15,26,16],[27,15,27,16],[27,17,27,18],[28,17,28,18],[29,17,29,18],[31,17,31,18],[32,17,32,18],[22,17,22,18],[29,13,29,14],[31,13,31,14],[32,13,32,14],[8,15,8,16],[9,15,9,16],[10,15,10,16],[11,15,11,16],[12,15,12,16],[13,15,13,16],[14,15,14,16],[15,15,15,16],[16,15,16,16],[17,15,17,16],[20,15,20,16],[21,15,21,16],[22,15,22,16],[24,13,24,14],[25,13,25,14],[26,13,26,14],[27,13,27,14],[28,13,28,14],[28,15,28,16],[29,15,29,16],[31,15,31,16],[31,11,31,12],[32,11,32,12],[8,13,8,14],[9,13,9,14],[10,13,10,14],[11,13,11,14],[12,13,12,14],[13,13,13,14],[14,13,14,14],[15,13,15,14],[16,13,16,14],[17,13,17,14],[20,13,20,14],[21,13,21,14],[22,13,22,14],[23,13,23,14],[25,11,25,12],[26,11,26,12],[27,11,27,12],[28,11,28,12],[29,11,29,12],[20,11,20,12],[21,11,21,12],[22,11,22,12],[23,11,23,12],[24,11,24,12],[13,11,13,12],[14,11,14,12],[15,11,15,12],[16,11,16,12],[17,11,17,12],[16,7,16,8],[16,9,16,10],[27,1,27,2],[15,1,15,2],[15,9,15,10],[26,7,26,8],[26,9,26,10],[27,7,27,8],[27,9,27,10],[29,1,29,2],[17,1,17,2],[27,5,27,6],[29,5,29,6],[26,5,26,6],[23,5,23,6],[24,5,24,6],[25,5,25,6],[16,1,16,2],[28,1,28,2],[28,5,28,6],[28,7,28,8],[28,9,28,10],[6,0,29,0],[14,9,14,10],[8,7,8,8],[8,9,8,10],[7,1,7,3],[19,1,19,3],[8,5,8,6],[9,5,9,6],[10,5,10,6],[11,5,11,6],[12,5,12,6],[13,5,13,6],[14,5,14,6],[13,7,13,8],[13,9,13,10],[15,7,15,8],[29,7,29,8],[29,9,29,10],[25,7,25,8],[25,9,25,10],[24,7,24,8],[24,9,24,10],[32,7,32,8],[32,9,32,10],[31,0,31,3],[31,5,31,6],[31,7,31,8],[31,9,31,10],[32,0,32,3],[32,5,32,6],[14,7,14,8],[15,5,15,6],[23,7,23,8],[23,9,23,10],[22,7,22,8],[22,9,22,10],[17,5,17,6],[20,5,20,6],[21,5,21,6],[22,5,22,6],[17,9,17,10],[21,9,21,10],[17,7,17,8],[21,7,21,8],[20,7,20,8],[20,9,20,10],[1,20,1,21],[2,1,5,2],[2,3,5,3],[2,20,5,20],[2,21,5,21],[1,1,1,3],[10,7,10,8],[10,9,10,10],[12,7,12,8],[12,9,12,10],[9,7,9,8],[9,9,9,10],[11,7,11,8],[11,9,11,10],[8,11,8,12],[9,11,9,12],[10,11,10,12],[11,11,11,12],[12,11,12,12]]}
[null,"CUADRO C: DISTRIBUCIÓN DE HORAS PEDAGÓGICAS NO LECTIVAS"]
[null,"Acciones a implementar para el logro de los objetivos institucionales",null,null,null,"Docentes ",null,null,null,null,null,null,null,null,null,null,null,null,null,null,"Resultado "]
[null,"Tipo de carga no lectiva ",null,"Carga  no lectiva requerida",null,"Nombre:",{"$f":"B!I3","v":"CARMEN ROSA CRISOSTOMO ELESCANO"},"Nombre:",{"$f":"B!K3","v":"TEODOLINDA JUANA ORIHUELA BENITO"},"Nombre:",{"$f":"B!M3","v":"ANGELICA GRACIELA MANTARI BUENDIA"},"Nombre:",{"$f":"B!O3","v":"NORMA YOLANDA CONDOR LAZO"},"Nombre:",{"$f":"B!Q3","v":"LUCY AMELIA CARDENAS ILLESCAS"},"Nombre:",{"$f":"B!S3","v":"JESUS ROBERTO GUTIERREZ  CANGAHUALA "},"Nombre:",{"$f":"B!U3","v":"PERCY EDGAR ROJAS HUANQUI"},null,"Horas distribuidas","Necesidad de horas"]
[null,null,null,null,null,"DNI N°",{"$f":"B!I4","v":19926825},"DNI N°",{"$f":"B!K4","v":20640096},"DNI N°",{"$f":"B!M4","v":19959386},"DNI N°",{"$f":"B!O4","v":20041828},"DNI N°",{"$f":"B!Q4","v":21252068},"DNI N°",{"$f":"B!S4","v":20429212},"DNI N°",{"$f":"B!U4","v":23271260}]
[null,null,null,null,null,"Área de desempeño ",{"$f":"B!I5","v":"DOCENTE"},"Área de desempeño ",{"$f":"B!K5","v":"DOCENTE"},"Área de desempeño ",{"$f":"B!M5","v":"DOCENTE"},"Área de desempeño ",{"$f":"B!O5","v":"DOCENTE"},"Área de desempeño ",{"$f":"B!Q5","v":"DOCENTE"},"Área de desempeño ",{"$f":"B!S5","v":"DOCENTE"},"Área de desempeño ",{"$f":"B!U5","v":"DOCENTE"}]
[null,null,null,null,null,"Jornada laboral:",{"$f":"B!I6","v":40},"Jornada laboral:",{"$f":"B!K6","v":40},"Jornada laboral:",{"$f":"B!M6","v":40},"Jornada laboral:",{"$f":"B!O6","v":40},"Jornada laboral:",{"$f":"B!Q6","v":40},"Jornada laboral:",{"$f":"B!S6","v":40},"Jornada laboral:",{"$f":"B!U6","v":40}]
["DISTRIBUCIÓN DE HORAS NO LECTIVAS Y DE GESTIÓN PEDAGÓGICA",null,"Periodo académico Marzo- Julio ",null,null,null,null,null,null,null,null,null,null,null,null,null,null,null,null,null,"Suma de carga no lectiva distribuida por actividad","(Carga no lectiva requerida) - (Horas distribuidas)"]
[null,"Actividades no lectivas",null,null,null,"Horas por asignar: ",{"$f":"G6-B!H52","v":22},"Horas por asignar: ",{"$f":"I6-B!J52","v":22},"Horas por asignar: ",{"$f":"K6-B!L52","v":22},"Horas por asignar: ",{"$f":"M6-B!N52","v":22},"Horas por asignar: ",{"$f":"O6-B!P52","v":21},"Horas por asignar: ",{"$f":"Q6-B!R52","v":37},"Horas por asignar: ",{"$f":"S6-B!T52","v":37}]
[null,"Diseño y desarrollo Académico",null,null,null,5,null,5,null,5,null,5,null,5,null,null,null,null,null,null,{"$f":"SUM(F9:O9)","v":25},{"$f":"D9-U9","v":-25}]
[null,"Desarrollo institucional",null,null,null,5,null,5,null,5,null,5,null,4,null,null,null,null,null,null,{"$f":"SUM(F10:O10)","v":24},{"$f":"D10-U10","v":-24}]
[null,"Estrategias de articulación con el sector productivo",null,null,null,null,null,null,null,7,null,null,null,null,null,null,null,null,null,null,{"$f":"SUM(F11:K11)","v":7},-7]
[null,"Investigación e innovación",null,null,null,7,null,null,null,null,null,null,null,null,null,null,null,null,null,null,7,-7]
[null,"Preparación de clase",null,null,null,5,null,5,null,5,null,5,null,5,null,null,null,null,null,null,{"$f":"SUM(F13:O13)","v":25},-25]
[null,"Seguimiento y servicios de apoyo al estudiante y egresado",null,null,null,null,null,7,null,null,null,null,null,null,null,null,null,null,null,null,7,-7]
[null,"Supervisión de experiencias formativas en situaciones reales de trabajo ",null,null,null,null,null,null,null,null,null,null,null,7,null,null,null,null,null,null,0,0]
{"$rows_left_out":22}
{"sheet":"D","index":3,"n_rows":60,"n_cols":15,"rows_kept":60,"cut":false,"hidden":false,"merged":[[58,1,59,3],[2,6,2,7],[2,1,4,1],[2,2,4,2],[2,3,4,3],[2,4,4,4],[41,2,41,4],[2,14,4,14],[2,13,4,13],[2,5,4,5],[3,6,4,6],[3,7,4,7]]}
[null,"CUADRO D: DETERMINACIÓN DE LAS POSICIONES VACANTES"]
[null,"Plan de estudios",null,null,null,null,null,null,null,"Posiciones Vacantes ",null,null,null,"                                       Resultado "]
[null,"Periodo académico","Módulo formativo asociado","Unidad Didáctica","Nombre de Unidad Didáctica (UD)","Necesidad de horas","Perfil Docente",null,null,"Posición  1",{"$f":"+\"Posición  \"&(MID(J3,9,20)*1+1)","v":"Posición  2"},{"$f":"+\"Posición  \"&(MID(K3,9,20)*1+1)","v":"Posición  3"},null,"Carga lectiva y no lectiva distribuida","Horas  no distribuidas"]
[null,null,null,null,null,null,"Formación Académica ","Experiencia específica",null,"Jornada laboral:","Jornada laboral:","Jornada laboral:"]
[]
[null,null,"Distribución de horas lectivas",null,null,null,null,null,null,"xxxx","xxxx","xxxx",null,"Suma de carga distribuida por actividad","(Necesidad de horas) - (Suma de carga distribuida por UD o actividad)"]
[null,"Mar-Jul","Módulo 1","UD 4",{"$f":"+IFERROR(OFFSET(B!$E$7,MATCH($I7,B!$G$8:$G$4978,0),0,1,1),\"Sin Datos\")","v":"Primeros auxilios"},{"$f":"+IFERROR(OFFSET(B!$E$7,MATCH($I7,B!$G$8:$G$4978,0),MATCH($F$3,B!$B$1:$AAX$1,0)-4,1,1),E7)","v":0},"Lic. Enfermeria","Formacion PA",{"$f":"+B7&\"_\"&C7&\"_\"&D7","v":"Mar-Jul_Módulo 1_UD 4"},6,null,null,null,{"$f":"SUM(J7:L7)","v":6},{"$f":"F7-N7","v":-6}]
[null,{"$f":"+B7","v":"Mar-Jul"},{"$f":"+C7","v":"Módulo 1"},"UD 5",{"$f":"+IFERROR(OFFSET(B!$E$7,MATCH($I8,B!$G$8:$G$4978,0),0,1,1),\"Sin Datos\")","v":"Comunicación oral"},{"$f":"+IFERROR(OFFSET(B!$E$7,MATCH($I8,B!$G$8:$G$4978,0),MATCH($F$3,B!$B$1:$AAX$1,0)-4,1,1),E8)","v":0},"Lic.pedagogia","Formacion CO",{"$f":"+B8&\"_\"&C8&\"_\"&D8","v":"Mar-Jul_Módulo 1_UD 5"},null,null,3,null,{"$f":"SUM(J8:L8)","v":3},{"$f":"F8-N8","v":-3}]
[null,{"$f":"+B8","v":"Mar-Jul"},{"$f":"+C8","v":"Módulo 1"},"UD 6",{"$f":"+IFERROR(OFFSET(B!$E$7,MATCH($I9,B!$G$8:$G$4978,0),0,1,1),\"Sin Datos\")","v":"Ofimatica"},{"$f":"+IFERROR(OFFSET(B!$E$7,MATCH($I9,B!$G$8:$G$4978,0),MATCH($F$3,B!$B$1:$AAX$1,0)-4,1,1),E9)","v":0},"Lic.en computacion","Formacion OF","Mar-Jul_Módulo 1_UD 6",null,null,2,null,2,-2]
[null,null,{"$f":"+\"Sub total \"&C9","v":"Sub total Módulo 1"},null,null,null,null,null,"_Sub total Módulo 1_","xxxx","xxxx","xxxx"]
[null,"Mar-Jul","Módulo 2","UD 5",{"$f":"+IFERROR(OFFSET(B!$E$7,MATCH($I11,B!$G$8:$G$4978,0),0,1,1),\"Sin Datos\")","v":"Fundamentos de investigacion e innovacion tecnologica"},{"$f":"+IFERROR(OFFSET(B!$E$7,MATCH($I11,B!$G$8:$G$4978,0),MATCH($F$3,B!$B$1:$AAX$1,0)-4,1,1),E11)","v":0},"Lic.pedagogia"," INVESTIGACIONES",{"$f":"+B11&\"_\"&C11&\"_\"&D11","v":"Mar-Jul_Módulo 2_UD 5"},null,null,3,null,{"$f":"SUM(J11:L11)","v":3},{"$f":"F11-N11","v":-3}]
[null,{"$f":"+B11","v":"Mar-Jul"},{"$f":"+C11","v":"Módulo 2"},"UD 5",{"$f":"+IFERROR(OFFSET(B!$E$7,MATCH($I12,B!$G$8:$G$4978,0),0,1,1),\"Sin Datos\")","v":"Fundamentos de investigacion e innovacion tecnologica"},{"$f":"+IFERROR(OFFSET(B!$E$7,MATCH($I12,B!$G$8:$G$4978,0),MATCH($F$3,B!$B$1:$AAX$1,0)-4,1,1),E12)","v":0},null,null,{"$f":"+B12&\"_\"&C12&\"_\"&D12","v":"Mar-Jul_Módulo 2_UD 5"},null,null,null,null,{"$f":"SUM(J12:L12)","v":0},{"$f":"F12-N12","v":0}]
[null,{"$f":"+B12","v":"Mar-Jul"},{"$f":"+C12","v":"Módulo 2"},"UD 5",{"$f":"+IFERROR(OFFSET(B!$E$7,MATCH($I13,B!$G$8:$G$4978,0),0,1,1),\"Sin Datos\")","v":"Fundamentos de investigacion e innovacion tecnologica"},{"$f":"+IFERROR(OFFSET(B!$E$7,MATCH($I13,B!$G$8:$G$4978,0),MATCH($F$3,B!$B$1:$AAX$1,0)-4,1,1),E13)","v":0},null,null,"Mar-Jul_Módulo 2_UD 5",null,null,null,null,0,0]
[null,null,{"$f":"+\"Sub total \"&C13","v":"Sub total Módulo 2"},null,null,null,null,null,"_Sub total Módulo 2_","xxxx","xxxx","xxxx"]
[null,"Mar-Jul","Módulo 3","UD 4",{"$f":"+IFERROR(OFFSET(B!$E$7,MATCH($I15,B!$G$8:$G$4978,0),0,1,1),\"Sin Datos\")","v":"Asistencia en salud mental"},{"$f":"+IFERROR(OFFSET(B!$E$7,MATCH($I15,B!$G$8:$G$4978,0),MATCH($F$3,B!$B$1:$AAX$1,0)-4,1,1),E15)","v":0},null,null,{"$f":"+B15&\"_\"&C15&\"_\"&D15","v":"Mar-Jul_Módulo 3_UD 4"},null,null,null,null,{"$f":"SUM(J15:L15)","v":0},{"$f":"F15-N15","v":0}]
{"$rows_left_out":46}
{"sheet":"E","index":4,"n_rows":18,"n_cols":28,"rows_kept":18,"cut":false,"hidden":false,"merged":[[4,4,4,15],[5,26,6,27],[4,16,4,27],[2,1,3,27],[4,3,7,3],[6,4,6,5],[6,6,6,7],[6,8,6,9],[6,16,6,17],[6,18,6,19],[6,20,6,21],[5,4,5,9],[5,16,5,21],[4,1,4,2],[5,1,7,1],[5,2,7,2],[5,10,6,13],[5,22,6,25],[5,14,6,15]]}
[]
[]
[null,"CUADRO E: RESUMEN  DE POSICIONES VACANTES"]
[]
[null,"Perfil Docente",null,"Jornada laboral:","Periodo académico Marzo - Julio",null,null,null,null,null,null,null,null,null,null,null,"Periodo académico Agosto - Diciembre"]
[null,"Formación Académica","Experiencia específica",null,"Carga lectiva",null,null,null,null,null,"Carga  no lectiva",null,null,null,"Gestión Pedagógica",null,"Carga lectiva",null,null,null,null,null,"Carga  no lectiva",null,null,null,"Gestión Pedagógica"]
[null,null,null,null,"UD 1",null,"UD 2",null,"UD 3",null,null,null,null,null,null,null,"UD 1",null,"UD 2",null,"UD 3"]
[null,null,null,null,"Nombre","Horas ","Nombre","Horas ","Nombre","Horas ","Actividad 1","Actividad 2","Actividad 3","Actividad 4","Puesto","Horas ","Nombre","Horas ","Nombre","Horas ","Nombre","Horas ","Actividad 1","Actividad 2","Actividad 3","Actividad 4","Puesto","Horas "]
["Posición  1"]
["Posición  2"]
["Posición  3"]
["Posición  4"]
["Posición  5"]
["Posición  6"]
["Posición  7"]
{"$rows_left_out":4}
{"sheet":"Maestros","index":5,"n_rows":22,"n_cols":3,"rows_kept":22,"cut":false,"hidden":true,"merged":[]}
[]
[]
["Mar-Jul","Módulo 1","UD 1"]
["Ago-Dic","Módulo 2","UD 2"]
[null,"Módulo 3","UD 3"]
[null,"Módulo 4","UD 4"]
[null,"Módulo 5","UD 5"]
[null,"Módulo 6","UD 6"]
[null,"Módulo 7","UD 7"]
[null,"Módulo 8","UD 8"]
[null,"Módulo 9","UD 9"]
[null,"Módulo 10","UD 10"]
[null,"Módulo 11","UD 11"]
[null,"Módulo 12","UD 12"]
[null,"Módulo 13","UD 13"]
{"$rows_left_out":7}